Target
Lysophosphatidic acid receptor 1
Ligand
BDBM557823
Substrate
Meas. Tech.
LPAR1 Membrane Binding Assay
Ki
51.4±n/a nM
Citation
 Ma, TWu, LZhang, X Lysophosphatidic acid receptor 1 (LPAR1) inhibitor compounds US Patent  US11365185 Publication Date 6/21/2022 
Target
Name:
Lysophosphatidic acid receptor 1
Synonyms:
EDG2 LPA-1 LPAR1 Lysophosphatidic acid receptor 1 (LPA1) | Lysophosphatidic acid receptor Edg-2
Type:
Enzyme
Mol. Mass.:
41120.55
Organism:
Homo sapiens (Human)
Description:
Q92633
Residue:
364
  
Inhibitor
Name:
BDBM557823
Synonyms:
1-[4-[6-[5-[[6-(3,3-difluorocyclobutoxy)pyrazin-2-yl]amino]-1-methyl-pyrazol-4-yl]-3-pyridyl]phenyl]cyclopropanecarboxylic Acid | US11365185, Example 5B
Type:
Small organic molecule
Emp. Form.:
C27H24F2N6O3
Mol. Mass.:
518.5147
SMILES:
Cn1ncc(c1Nc1cncc(OC2CC(F)(F)C2)n1)-c1ccc(cn1)-c1ccc(cc1)C1(CC1)C(O)=O
: