Target
Lysophosphatidic acid receptor 1
Ligand
BDBM557828
Substrate
Meas. Tech.
LPAR1 Membrane Binding Assay
Ki
12.5±n/a nM
Citation
 Ma, TWu, LZhang, X Lysophosphatidic acid receptor 1 (LPAR1) inhibitor compounds US Patent  US11365185 Publication Date 6/21/2022 
Target
Name:
Lysophosphatidic acid receptor 1
Synonyms:
EDG2 LPA-1 LPAR1 Lysophosphatidic acid receptor 1 (LPA1) | Lysophosphatidic acid receptor Edg-2
Type:
Enzyme
Mol. Mass.:
41120.55
Organism:
Homo sapiens (Human)
Description:
Q92633
Residue:
364
  
Inhibitor
Name:
BDBM557828
Synonyms:
1-[4-[6-[5-[[6-(cyclopropoxy)pyrazin-2-yl]amino]-1-methyl-pyrazol-4-yl]-3-pyridyl]phenyl]cyclopropanecarboxylic Acid | US11365185, Example 10B
Type:
Small organic molecule
Emp. Form.:
C26H24N6O3
Mol. Mass.:
468.5072
SMILES:
Cn1ncc(c1Nc1cncc(OC2CC2)n1)-c1ccc(cn1)-c1ccc(cc1)C1(CC1)C(O)=O
: