Target
Lysophosphatidic acid receptor 1
Ligand
BDBM557830
Substrate
Meas. Tech.
LPAR1 Membrane Binding Assay
Ki
40.9±n/a nM
Citation
 Ma, TWu, LZhang, X Lysophosphatidic acid receptor 1 (LPAR1) inhibitor compounds US Patent  US11365185 Publication Date 6/21/2022 
Target
Name:
Lysophosphatidic acid receptor 1
Synonyms:
EDG2 LPA-1 LPAR1 Lysophosphatidic acid receptor 1 (LPA1) | Lysophosphatidic acid receptor Edg-2
Type:
Enzyme
Mol. Mass.:
41120.55
Organism:
Homo sapiens (Human)
Description:
Q92633
Residue:
364
  
Inhibitor
Name:
BDBM557830
Synonyms:
1-[4-[6-[5-[[6-(1,1-difluoroethyl)pyrazin-2-yl]amino]-1-methyl-pyrazol-4-yl]-3-pyridyl]phenyl]cyclopropanecarboxylic Acid; Hydrochloride | US11365185, Example 12B
Type:
Small organic molecule
Emp. Form.:
C25H22F2N6O2
Mol. Mass.:
476.478
SMILES:
Cn1ncc(c1Nc1cncc(n1)C(C)(F)F)-c1ccc(cn1)-c1ccc(cc1)C1(CC1)C(O)=O
: