Target
Lysophosphatidic acid receptor 1
Ligand
BDBM557836
Substrate
Meas. Tech.
LPAR1 Membrane Binding Assay
Ki
24.5±n/a nM
Citation
 Ma, TWu, LZhang, X Lysophosphatidic acid receptor 1 (LPAR1) inhibitor compounds US Patent  US11365185 Publication Date 6/21/2022 
Target
Name:
Lysophosphatidic acid receptor 1
Synonyms:
EDG2 LPA-1 LPAR1 Lysophosphatidic acid receptor 1 (LPA1) | Lysophosphatidic acid receptor Edg-2
Type:
Enzyme
Mol. Mass.:
41120.55
Organism:
Homo sapiens (Human)
Description:
Q92633
Residue:
364
  
Inhibitor
Name:
BDBM557836
Synonyms:
1-[4-[2-[5-[(6-isopropylpyrazin-2-yl)amino]-1-methyl-pyrazol-4-yl]pyrimidin-5-yl]phenyl]cyclopropanecarboxylic acid | US11365185, Example 18B
Type:
Small organic molecule
Emp. Form.:
C25H25N7O2
Mol. Mass.:
455.5117
SMILES:
CC(C)c1cncc(Nc2c(cnn2C)-c2ncc(cn2)-c2ccc(cc2)C2(CC2)C(O)=O)n1
: