Target
Lysophosphatidic acid receptor 1
Ligand
BDBM557838
Substrate
Meas. Tech.
LPAR1 Membrane Binding Assay
Ki
12.7±n/a nM
Citation
 Ma, TWu, LZhang, X Lysophosphatidic acid receptor 1 (LPAR1) inhibitor compounds US Patent  US11365185 Publication Date 6/21/2022 
Target
Name:
Lysophosphatidic acid receptor 1
Synonyms:
EDG2 LPA-1 LPAR1 Lysophosphatidic acid receptor 1 (LPA1) | Lysophosphatidic acid receptor Edg-2
Type:
Enzyme
Mol. Mass.:
41120.55
Organism:
Homo sapiens (Human)
Description:
Q92633
Residue:
364
  
Inhibitor
Name:
BDBM557838
Synonyms:
1-[4-[6-[5-[(6-isopropoxypyrazin-2-yl)amino]-1-methyl-pyrazol-4-yl]-3-pyridyl]phenyl]cyclopropanecarboxylic Acid; Hydrochloride | US11365185, Example 20B
Type:
Small organic molecule
Emp. Form.:
C26H26N6O3
Mol. Mass.:
470.523
SMILES:
CC(C)Oc1cncc(Nc2c(cnn2C)-c2ccc(cn2)-c2ccc(cc2)C2(CC2)C(O)=O)n1
: