Target
Lysophosphatidic acid receptor 1
Ligand
BDBM557839
Substrate
Meas. Tech.
LPAR1 Membrane Binding Assay
Ki
27.6±n/a nM
Citation
 Ma, TWu, LZhang, X Lysophosphatidic acid receptor 1 (LPAR1) inhibitor compounds US Patent  US11365185 Publication Date 6/21/2022 
Target
Name:
Lysophosphatidic acid receptor 1
Synonyms:
EDG2 LPA-1 LPAR1 Lysophosphatidic acid receptor 1 (LPA1) | Lysophosphatidic acid receptor Edg-2
Type:
Enzyme
Mol. Mass.:
41120.55
Organism:
Homo sapiens (Human)
Description:
Q92633
Residue:
364
  
Inhibitor
Name:
BDBM557839
Synonyms:
1-[4-[6-[1-methyl-5-[[6-(trifluoromethyl)pyrazin-2-yl]amino]pyrazol-4-yl]-3-pyridyl]phenyl]cyclopropanecarboxylic Acid | US11365185, Example 21B
Type:
Small organic molecule
Emp. Form.:
C24H19F3N6O2
Mol. Mass.:
480.4419
SMILES:
Cn1ncc(c1Nc1cncc(n1)C(F)(F)F)-c1ccc(cn1)-c1ccc(cc1)C1(CC1)C(O)=O
: