Target
Lysophosphatidic acid receptor 1
Ligand
BDBM557843
Substrate
Meas. Tech.
LPAR1 Membrane Binding Assay
Ki
30.8±n/a nM
Citation
 Ma, TWu, LZhang, X Lysophosphatidic acid receptor 1 (LPAR1) inhibitor compounds US Patent  US11365185 Publication Date 6/21/2022 
Target
Name:
Lysophosphatidic acid receptor 1
Synonyms:
EDG2 LPA-1 LPAR1 Lysophosphatidic acid receptor 1 (LPA1) | Lysophosphatidic acid receptor Edg-2
Type:
Enzyme
Mol. Mass.:
41120.55
Organism:
Homo sapiens (Human)
Description:
Q92633
Residue:
364
  
Inhibitor
Name:
BDBM557843
Synonyms:
US11365185, Example 25B
Type:
Small organic molecule
Emp. Form.:
C24H20ClN5O2
Mol. Mass.:
445.901
SMILES:
Cn1ncc(c1Nc1cncc(Cl)n1)-c1ccc(cc1)-c1ccc(cc1)C1(CC1)C(O)=O
: