Target
2-Hydroxyacid oxidase 1
Ligand
BDBM560933
Substrate
Meas. Tech.
In-Vitro Human Glycolate Oxidase (hGOX) Assay
IC50
4.00±n/a nM
Citation
 Keller, BTTalley, JJ Compounds and methods for treating oxalate-related diseases US Patent  US11389456 Publication Date 7/19/2022 
Target
Name:
2-Hydroxyacid oxidase 1
Synonyms:
GOX1 HAOX1_HUMAN | Hydroxyacid oxidase 1
Type:
PROTEIN
Mol. Mass.:
40927.89
Organism:
Homo sapiens (Human)
Description:
ChEMBL_71275
Residue:
370
  
Inhibitor
Name:
BDBM560933
Synonyms:
5-(4- (benzo[d][1,3]dioxol- 5-yl)phenoxy)-1H- 1,2,3-triazole-4- carboxylic acid | US11389456, Ex. No. I-304
Type:
Small organic molecule
Emp. Form.:
C15H11N3O3
Mol. Mass.:
281.2661
SMILES:
C1Oc2ccc(cc2O1)-c1ccc(Oc2cnn[nH]2)cc1
: