Target
Cyclin-dependent kinase 4/G1/S-specific cyclin-D3
Ligand
BDBM370233
Substrate
Meas. Tech.
CDK4/Cyclin D3 Mobility Shift Assay
Ki
0.340±n/a nM
Citation
 Behenna, DCChen, PFreeman-Cook, KDHoffman, RLJalaie, MNagata, ANair, SKNinkovic, SOrnelas, MAPalmer, CLRui, EY CDK2/4/6 inhibitors US Patent  US11396512 Publication Date 7/26/2022 
Target
Name:
Cyclin-dependent kinase 4/G1/S-specific cyclin-D3
Synonyms:
CDK4/Cyclin D3
Type:
Mol. Mass.:
Description:
ASSAY_ID of ChEMBL is 1806445
Components:
This complex has 2 components.
Component 1
Name:
Cyclin-dependent kinase 4
Synonyms:
CDK4 Cell division protein kinase 4 PSK-J3
Type:
Enzyme Subunit
Mol. Mass.:
33731.96
Organism:
Homo sapiens (Human)
Description:
P11802
Residue:
303
  
Component 2
Name:
G1/S-specific cyclin-D3
Synonyms:
CCND3 | CCND3_HUMAN
Type:
Enzyme
Mol. Mass.:
32521.90
Organism:
Homo sapiens (Human)
Description:
P30281
Residue:
292
  
Inhibitor
Name:
BDBM370233
Synonyms:
US10233188, Example 120 US11396512, Example 120
Type:
Small organic molecule
Emp. Form.:
C21H28N6O4S
Mol. Mass.:
460.55
SMILES:
C[C@@]1(O)CCC[C@H]1n1c2nc(NC3CCN(CC3)S(C)(=O)=O)ncc2cc(CC#N)c1=O
: