Target
cAMP and cAMP-inhibited cGMP 3',5'-cyclic phosphodiesterase 10A
Ligand
BDBM239778
Substrate
Meas. Tech.
PDE10A assay
IC50
0.64±n/a nM
Citation
 Tosstorff, ARudolph, MGCole, JCReutlinger, MKramer, CSchaffhauser, HNilly, AFlohr, AKuhn, B A high quality, industrial data set for binding affinity prediction: performance comparison in different early drug discovery scenarios. J Comput Aided Mol Des 36:753-765 (2022)  
Target
Name:
cAMP and cAMP-inhibited cGMP 3',5'-cyclic phosphodiesterase 10A
Synonyms:
3',5'-cyclic phosphodiesterase PDE10_HUMAN Phosphodiesterase 10A
Type:
Protein
Mol. Mass.:
88412.52
Organism:
Homo sapiens (Human)
Description:
Q9Y233
Residue:
779
  
Inhibitor
Name:
BDBM239778
Synonyms:
Roche-Dataset for PDE10A, Compound 97 | US9394311, 61
Type:
Small organic molecule
Emp. Form.:
C23H25Cl2N7O
Mol. Mass.:
486.397
SMILES:
COc1ccc(Cn2nc(nc2CCc2nc3c(Cl)cc(Cl)c(C)n3n2)N2CCCC2)cc1
: