Target
cAMP and cAMP-inhibited cGMP 3',5'-cyclic phosphodiesterase 10A
Ligand
BDBM563806
Substrate
Meas. Tech.
PDE10A assay
IC50
0.60±n/a nM
Citation
 Tosstorff, ARudolph, MGCole, JCReutlinger, MKramer, CSchaffhauser, HNilly, AFlohr, AKuhn, B A high quality, industrial data set for binding affinity prediction: performance comparison in different early drug discovery scenarios. J Comput Aided Mol Des 36:753-765 (2022)  
Target
Name:
cAMP and cAMP-inhibited cGMP 3',5'-cyclic phosphodiesterase 10A
Synonyms:
3',5'-cyclic phosphodiesterase PDE10A Phosphodiesterase 10 (PDE10) | Phosphodiesterase 10A
Type:
Protein
Mol. Mass.:
88412.52
Organism:
Homo sapiens (Human)
Description:
Q9Y233
Residue:
1055
  
Inhibitor
Name:
BDBM563806
Synonyms:
Roche-Dataset for PDE10A, Compound 120
Type:
Small Organic Molecule
Emp. Form.:
C22H21N7O3
Mol. Mass.:
431.4472
SMILES:
COc1ccccc1-c1nc2cc(NC(=O)c3c(cnn3C)C(=O)N3CCC3)ccn2n1
: