Target
cAMP and cAMP-inhibited cGMP 3',5'-cyclic phosphodiesterase 10A
Ligand
BDBM239799
Substrate
Meas. Tech.
PDE10A assay
IC50
0.43±n/a nM
Citation
 Tosstorff, ARudolph, MGCole, JCReutlinger, MKramer, CSchaffhauser, HNilly, AFlohr, AKuhn, B A high quality, industrial data set for binding affinity prediction: performance comparison in different early drug discovery scenarios. J Comput Aided Mol Des 36:753-765 (2022)  
Target
Name:
cAMP and cAMP-inhibited cGMP 3',5'-cyclic phosphodiesterase 10A
Synonyms:
3',5'-cyclic phosphodiesterase PDE10_HUMAN Phosphodiesterase 10A
Type:
Protein
Mol. Mass.:
88412.52
Organism:
Homo sapiens (Human)
Description:
Q9Y233
Residue:
779
  
Inhibitor
Name:
BDBM239799
Synonyms:
Roche-Dataset for PDE10A, Compound 135 | US9394311, 82
Type:
Small organic molecule
Emp. Form.:
C17H19BrF3N7
Mol. Mass.:
458.279
SMILES:
Cc1c(Br)cc(c2nc(CCc3nc(nn3C)N3CCCC3)nn12)C(F)(F)F
: