Target
cAMP and cAMP-inhibited cGMP 3',5'-cyclic phosphodiesterase 10A
Ligand
BDBM563986
Substrate
Meas. Tech.
PDE10A assay
IC50
0.33±n/a nM
Citation
 Tosstorff, ARudolph, MGCole, JCReutlinger, MKramer, CSchaffhauser, HNilly, AFlohr, AKuhn, B A high quality, industrial data set for binding affinity prediction: performance comparison in different early drug discovery scenarios. J Comput Aided Mol Des 36:753-765 (2022)  
Target
Name:
cAMP and cAMP-inhibited cGMP 3',5'-cyclic phosphodiesterase 10A
Synonyms:
3',5'-cyclic phosphodiesterase PDE10_HUMAN Phosphodiesterase 10A
Type:
Protein
Mol. Mass.:
88412.52
Organism:
Homo sapiens (Human)
Description:
Q9Y233
Residue:
779
  
Inhibitor
Name:
BDBM563986
Synonyms:
Roche-Dataset for PDE10A, Compound 300
Type:
Small Organic Molecule
Emp. Form.:
C17H20ClN7
Mol. Mass.:
357.841
SMILES:
Cc1cc(Cl)c(C)n2nc(\C=C\c3nc(nn3C)N3CCCC3)nc12
: