Target
Bromodomain-containing protein 9 [133-239]
Ligand
BDBM565262
Substrate
Meas. Tech.
Bromodomain TR-FRET Competition Binding Assay
IC50
<10±n/a nM
Citation
 Ruppel, SKYang, ZLowe, JTVoigt, JHNetherton, M Compounds and uses thereof US Patent  US11414416 Publication Date 8/16/2022 
Target
Name:
Bromodomain-containing protein 9 [133-239]
Synonyms:
BRD9 Bromodomain-containing protein 9 (BRD9)(133-239)
Type:
Enzyme Catalytic Domain
Mol. Mass.:
12383.34
Organism:
Homo sapiens (Human)
Description:
aa 133-239
Residue:
107
  
Inhibitor
Name:
BDBM565262
Synonyms:
US11414416, Compound D3 azetidine-3-carboxamide
Type:
Small organic molecule
Emp. Form.:
C40H43N7O8
Mol. Mass.:
749.8115
SMILES:
COc1cc(cc(OC)c1CN1CC(C1)C(=O)NCCCCCNc1cccc2C(=O)N(C3CCC(=O)NC3=O)C(=O)c12)-c1cn(C)c(=O)c2cnccc12
: