Target
Bromodomain-containing protein 9 [133-239]
Ligand
BDBM565283
Substrate
Meas. Tech.
Bromodomain TR-FRET Competition Binding Assay
IC50
<10±n/a nM
Citation
 Ruppel, SKYang, ZLowe, JTVoigt, JHNetherton, M Compounds and uses thereof US Patent  US11414416 Publication Date 8/16/2022 
Target
Name:
Bromodomain-containing protein 9 [133-239]
Synonyms:
BRD9 Bromodomain-containing protein 9 (BRD9)(133-239)
Type:
Enzyme Catalytic Domain
Mol. Mass.:
12383.34
Organism:
Homo sapiens (Human)
Description:
aa 133-239
Residue:
107
  
Inhibitor
Name:
BDBM565283
Synonyms:
4-(4-(6-(2,6-dimethoxy-4-(2-methyl-1-oxo-1,2-dihydro-2,7-naphthyridin-4-yl)benzyl)-2,6-diazaspiro[3.3]heptan-2-yl)-4-oxobutoxy)-2-(2,6-dioxopiperidin-3-yl)isoindoline-1,3-dione US11560381, Compound D32
Type:
Small organic molecule
Emp. Form.:
C40H40N6O9
Mol. Mass.:
748.7804
SMILES:
COc1cc(cc(OC)c1CN1CC2(C1)CN(C2)C(=O)CCCOc1cccc2C(=O)N(C3CCC(=O)NC3=O)C(=O)c12)-c1cn(C)c(=O)c2cnccc12
: