Target
Bromodomain-containing protein 9 [133-239]
Ligand
BDBM565287
Substrate
Meas. Tech.
Bromodomain TR-FRET Competition Binding Assay
IC50
<10±n/a nM
Citation
 Ruppel, SKYang, ZLowe, JTVoigt, JHNetherton, M Compounds and uses thereof US Patent  US11414416 Publication Date 8/16/2022 
Target
Name:
Bromodomain-containing protein 9 [133-239]
Synonyms:
BRD9 Bromodomain-containing protein 9 (BRD9)(133-239)
Type:
Enzyme Catalytic Domain
Mol. Mass.:
12383.34
Organism:
Homo sapiens (Human)
Description:
aa 133-239
Residue:
107
  
Inhibitor
Name:
BDBM565287
Synonyms:
US11414416, Compound D36 | US11560381, Compound D36
Type:
Small organic molecule
Emp. Form.:
C38H36N6O9
Mol. Mass.:
720.7272
SMILES:
COc1cc(cc(OC)c1CN1CC2(C1)CN(C2)C(=O)COc1cccc2C(=O)N(C3CCC(=O)NC3=O)C(=O)c12)-c1cn(C)c(=O)c2cnccc12
: