Target
Bromodomain-containing protein 9 [133-239]
Ligand
BDBM565290
Substrate
Meas. Tech.
Bromodomain TR-FRET Competition Binding Assay
IC50
<10±n/a nM
Citation
 Ruppel, SKYang, ZLowe, JTVoigt, JHNetherton, M Compounds and uses thereof US Patent  US11414416 Publication Date 8/16/2022 
Target
Name:
Bromodomain-containing protein 9 [133-239]
Synonyms:
BRD9 Bromodomain-containing protein 9 (BRD9)(133-239)
Type:
Enzyme Catalytic Domain
Mol. Mass.:
12383.34
Organism:
Homo sapiens (Human)
Description:
aa 133-239
Residue:
107
  
Inhibitor
Name:
BDBM565290
Synonyms:
4-[4-(9-[[2,6-dimethoxy-4-(2-methyl-1-oxo-2,7-naphthyridin-4-yl)phenyl]methyl]-1-oxa-4,9-diazaspiro[5.5]undecan-4-yl)-4-oxobutoxy]-2-(2,6-dioxopiperidin-3-yl)isoindole-1,3-dione. US11560381, Compound D39
Type:
Small organic molecule
Emp. Form.:
C43H46N6O10
Mol. Mass.:
806.8595
SMILES:
COc1cc(cc(OC)c1CN1CCC2(CC1)CN(CCO2)C(=O)CCCOc1cccc2C(=O)N(C3CCC(=O)NC3=O)C(=O)c12)-c1cn(C)c(=O)c2cnccc12
: