Target
Bromodomain-containing protein 9 [133-239]
Ligand
BDBM565294
Substrate
Meas. Tech.
Bromodomain TR-FRET Competition Binding Assay
IC50
<10±n/a nM
Citation
 Ruppel, SKYang, ZLowe, JTVoigt, JHNetherton, M Compounds and uses thereof US Patent  US11414416 Publication Date 8/16/2022 
Target
Name:
Bromodomain-containing protein 9 [133-239]
Synonyms:
BRD9 Bromodomain-containing protein 9 (BRD9)(133-239)
Type:
Enzyme Catalytic Domain
Mol. Mass.:
12383.34
Organism:
Homo sapiens (Human)
Description:
aa 133-239
Residue:
107
  
Inhibitor
Name:
BDBM565294
Synonyms:
US11414416, Compound D53 propoxy]-2-(2,6-dioxopiperidin-3-yl)isoindole-1,3-dione
Type:
Small organic molecule
Emp. Form.:
C38H40N6O8
Mol. Mass.:
708.7596
SMILES:
COc1cc(cc(OC)c1CN1CCN(CCCOc2ccc3C(=O)N(C4CCC(=O)NC4=O)C(=O)c3c2)CC1)-c1cn(C)c(=O)c2cnccc12
: