Target
Gag-Pol polyprotein
Ligand
BDBM567114
Substrate
Meas. Tech.
Anti-HIV-1 Activity Test
EC50
3.00±n/a nM
Citation
 He, YZhang, HZheng, YZhang, YTang, CDing, WYang, LLi, Y DACOS type NNRTIS amino acid ester derivative, preparation method thereof, pharmaceutical composition, and application thereof US Patent  US11420959 Publication Date 8/23/2022 
Target
Name:
Gag-Pol polyprotein
Synonyms:
POL_HV1LW gag-pol
Type:
Protein
Mol. Mass.:
162115.08
Organism:
HIV-1
Description:
P0C6F2
Residue:
1435
  
Inhibitor
Name:
BDBM567114
Synonyms:
US11420959, Example I-13
Type:
Small organic molecule
Emp. Form.:
C26H35N3O4S
Mol. Mass.:
485.639
SMILES:
CCc1c(CC2CCCCC2)nc(SCC(=O)c2ccc(OC(=O)C(N)C(C)C)cc2)[nH]c1=O
: