Target
Egl nine homolog 1 [179-426]
Ligand
BDBM107704
Substrate
Meas. Tech.
EGLN-1 Activity Assay
IC50
410±n/a nM
Citation
 Kawamoto, RMWu, SEvdokimov, AGGreis, KDBoyer, ASWarshakoon, NC Prolyl hydroxylase inhibitors and methods of use US Patent  US11426393 Publication Date 8/30/2022 
Target
Name:
Egl nine homolog 1 [179-426]
Synonyms:
C1orf12 EGLN1_HUMAN | Hypoxia-inducible factor prolyl hydroxylase 2 (HIFPH2)
Type:
Mol. Mass.:
27759.84
Organism:
Homo sapiens (Human)
Description:
EGLN-1-179/426
Residue:
248
  
Inhibitor
Name:
BDBM107704
Synonyms:
US11426393, Compound Table XV.11 US8598210, Table XV, 10 US8722895, 10: {[5-(3-Chlorophenyl)-3-hydroxypyridine-2- carbonyl]amino}-acetic acid trifluoroacetic acid salt US9598370, Example 00136 | USRE47437, Example {[5-(3-Chlorophenyl)-3-hydroxypyridine-2-carbonyl]amino}-acetic acid
Type:
Small organic molecule
Emp. Form.:
C14H11ClN2O4
Mol. Mass.:
306.701
SMILES:
OC(=O)CNC(=O)c1ncc(cc1O)-c1cccc(Cl)c1
: