Target
Kelch-like ECH-associated protein 1 [321-624]
Ligand
BDBM486664
Substrate
Meas. Tech.
Fluorescence Based Assay
Kd
<1.000±n/a nM
Citation
 Barbay, JKChai, WHirst, GCKreutter, KDKummer, DAMcClure, KJNishimura, RTShih, AYVenable, JDVenkatesan, HWei, J Inhibitors of KEAP1-Nrf2 protein-protein interaction US Patent  US11427601 Publication Date 8/30/2022
Target
Name:
Kelch-like ECH-associated protein 1 [321-624]
Synonyms:
KEAP1 Kelch-like ECH-associated protein 1 (KEAP1)(321-624)
Type:
Enzyme Catalytic Domain
Mol. Mass.:
33399.63
Organism:
Homo sapiens (Human)
Description:
aa 321-624
Residue:
304
  
Inhibitor
Name:
BDBM486664
Synonyms:
US10947252, Example 100 | US11427601, Example 100
Type:
Small organic molecule
Emp. Form.:
C28H25ClF3N5O5S
Mol. Mass.:
636.042
SMILES:
Cc1ccc(cc1CN1CC2(CC2)Oc2nc(Cl)ccc2S1(=O)=O)[C@H](CC(O)=O)c1ccn2c(nnc2c1C)C(F)(F)F
: