Target
Kelch-like ECH-associated protein 1 [321-624]
Ligand
BDBM486687
Substrate
Meas. Tech.
Fluorescence Based Assay
Kd
<1.000±n/a nM
Citation
 Barbay, JKChai, WHirst, GCKreutter, KDKummer, DAMcClure, KJNishimura, RTShih, AYVenable, JDVenkatesan, HWei, J Inhibitors of KEAP1-Nrf2 protein-protein interaction US Patent  US11427601 Publication Date 8/30/2022
Target
Name:
Kelch-like ECH-associated protein 1 [321-624]
Synonyms:
KEAP1 Kelch-like ECH-associated protein 1 (KEAP1)(321-624)
Type:
Enzyme Catalytic Domain
Mol. Mass.:
33399.63
Organism:
Homo sapiens (Human)
Description:
aa 321-624
Residue:
304
  
Inhibitor
Name:
BDBM486687
Synonyms:
US10947252, Example 127 | US11427601, Example 127
Type:
Small organic molecule
Emp. Form.:
C39H47F3N6O7S
Mol. Mass.:
800.887
SMILES:
Cc1ccc(cc1CN1CC2(CCOCC2)Oc2nc(OCCN3CCCCC3)ccc2S1(=O)=O)[C@@H](c1ccn2c(nnc2c1C)C(F)(F)F)C(C)(C)C(O)=O
: