Target
Kelch-like ECH-associated protein 1 [321-624]
Ligand
BDBM486692
Substrate
Meas. Tech.
Fluorescence Based Assay
Kd
1.80±n/a nM
Citation
 Barbay, JKChai, WHirst, GCKreutter, KDKummer, DAMcClure, KJNishimura, RTShih, AYVenable, JDVenkatesan, HWei, J Inhibitors of KEAP1-Nrf2 protein-protein interaction US Patent  US11427601 Publication Date 8/30/2022
Target
Name:
Kelch-like ECH-associated protein 1 [321-624]
Synonyms:
KEAP1 Kelch-like ECH-associated protein 1 (KEAP1)(321-624)
Type:
Enzyme Catalytic Domain
Mol. Mass.:
33399.63
Organism:
Homo sapiens (Human)
Description:
aa 321-624
Residue:
304
  
Inhibitor
Name:
BDBM486692
Synonyms:
US10947252, Example 135 | US11427601, Example 135
Type:
Small organic molecule
Emp. Form.:
C30H34N6O5S
Mol. Mass.:
590.693
SMILES:
CCn1nnc2c(C)c(ccc12)C(CC(O)=O)c1ccc(C)c(CN2C[C@H]3COCCN3c3ncccc3S2(=O)=O)c1
: