Target
Cyclin-dependent kinase 9
Ligand
BDBM307949
Substrate
Meas. Tech.
TR-FRET Kinase Assay
IC50
49.0±n/a nM
Citation
 Mastracchio, ABruncko, MLai, CMiyashiro, JMTao, ZWoods, KWPenning, TDSouers, AJ Pyridine CDK9 kinase inhibitors US Patent  US9650358 Publication Date 5/16/2017 
Target
Name:
Cyclin-dependent kinase 9
Synonyms:
C-2K CDK9 Cell division cycle 2-like protein kinase 4 Cyclin-Dependent Kinase 9 (CDK9) Serine/threonine-protein kinase PITALRE Tat-associated kinase complex catalytic subunit
Type:
Enzyme Subunit
Mol. Mass.:
42789.13
Organism:
Homo sapiens (Human)
Description:
Residue:
372
  
Inhibitor
Name:
BDBM307949
Synonyms:
trans-N-{5-chloro-4-[1-(3-fluorobenzyl)-1H-benzimidazol-6-yl]pyridin-2-yl}-N′-(3-methoxypropyl)cyclohexane-1,4-diamine | US9650358, Example 245
Type:
Small organic molecule
Emp. Form.:
C29H33ClFN5O
Mol. Mass.:
522.057
SMILES:
COCCCN[C@H]1CC[C@@H](CC1)Nc1cc(c(Cl)cn1)-c1ccc2ncn(Cc3cccc(F)c3)c2c1
: