Target
5-hydroxytryptamine receptor 2A
Ligand
BDBM570517
Substrate
Meas. Tech.
Receptor Selection and Amplification (R-SAT) Assays
Ki
0.100±n/a nM
Citation
 Burstein, ESOlsson, RJansson, KESköld, NPWahlström, LYBorgström, BGVon Wachenfeldt, HBergner, MG Compounds, salts thereof and methods for treatment of diseases US Patent  US11440884 Publication Date 9/13/2022 
Target
Name:
5-hydroxytryptamine receptor 2A
Synonyms:
5-HT-2 5-HT2A 5-hydroxytryptamine receptor 2A (5HT-2A) 5HT2A_HUMAN HTR2A | Serotonin receptor 2A
Type:
undefined
Mol. Mass.:
52607.65
Organism:
Homo sapiens (Human)
Description:
P28223
Residue:
471
  
Inhibitor
Name:
BDBM570517
Synonyms:
US11440884, Example 3a | [4-(propan-2-yloxy)phenyl]methyl N-[(4-fluorophenyl)methyl]-N-[(3R,4S)-3-fluoropiperidin-4-yl]carbamate (3a)
Type:
Small organic molecule
Emp. Form.:
C23H28F2N2O3
Mol. Mass.:
418.4768
SMILES:
CC(C)Oc1ccc(COC(=O)N(Cc2ccc(F)cc2)[C@H]2CCNC[C@H]2F)cc1
: