Target
Enoyl-[acyl-carrier-protein] reductase [NADH] FabI
Ligand
BDBM8775
Substrate
BDBM8737
Meas. Tech.
Enzyme Inhibition Assay
Temperature
303.15±n/a K
IC50
2700±n/a nM
Comments
extracted
Citation
 Seefeld, MAMiller, WHNewlander, KABurgess, WJPayne, DJRittenhouse, SFMoore, TDDeWolf, WEKeller, PMQiu, XJanson, CAVaidya, KFosberry, APSmyth, MGJaworski, DDSlater-Radosti, CHuffman, WF Inhibitors of bacterial enoyl acyl carrier protein reductase (FabI): 2,9-disubstituted 1,2,3,4-tetrahydropyrido[3,4-b]indoles as potential antibacterial agents. Bioorg Med Chem Lett 11:2241-4 (2001)  
Target
Name:
Enoyl-[acyl-carrier-protein] reductase [NADH] FabI
Synonyms:
Enoyl - (acyl carrier protein) reductase Enoyl-[acyl-carrier-protein] reductase FABI_ECOLI envM | fabI
Type:
Enzyme
Mol. Mass.:
27861.12
Organism:
Escherichia coli
Description:
Residue:
262
  
Inhibitor
Name:
BDBM8775
Synonyms:
1,2,3,4-tetrahydro pyrido[3,4-b]indole 19 | 4-({2-benzoyl-1H,2H,3H,4H,9H-pyrido[3,4-b]indol-9-yl}methyl)phenol
Type:
Small organic molecule
Emp. Form.:
C25H22N2O2
Mol. Mass.:
382.4544
SMILES:
Oc1ccc(Cn2c3CN(CCc3c3ccccc23)C(=O)c2ccccc2)cc1
:
Substrate
Name:
BDBM8737
Synonyms:
2-Butenoyl-CoA Crotonoyl-CoA {[(2R,3S,4R,5R)-5-(6-amino-9H-purin-9-yl)-2-{[({[(3-{[2-({2-[(2E)-but-2-enoylsulfanyl]ethyl}carbamoyl)ethyl]carbamoyl}-3-hydroxy-2,2-dimethylpropoxy)(hydroxy)phosphoryl]oxy}(hydroxy)phosphoryl)oxy]methyl}-4-hydroxyoxolan-3-yl]oxy}phosphonic acid
Type:
Small organic molecule
Emp. Form.:
C25H40N7O17P3S
Mol. Mass.:
835.608
SMILES:
C\C=C\C(=O)SCCNC(=O)CCNC(=O)C(O)C(C)(C)COP(O)(=O)OP(O)(=O)OC[C@H]1O[C@H]([C@H](O)[C@@H]1OP(O)(O)=O)n1cnc2c(N)ncnc12
: