Target
Envelope glycoprotein
Ligand
BDBM574778
Substrate
Meas. Tech.
Inhibition of Infectivity of Recombinant VSVs Expressing Glycoproteins from Zaire Ebolavirus, Sudan Ebolavirus, Bundybugyo Ebolavirus, and Lassa Arenavirus
IC50
580±n/a nM
Citation
 Bowlin, TLMoir, DTChandran, KDye, Jr., JMWilliams, JDAron, ZDBarbor, JPLively, KNNash, PJMills, DMBasu, A Broad spectrum inhibitors of filoviruses US Patent  US11459308 Publication Date 10/4/2022 
Target
Name:
Envelope glycoprotein
Synonyms:
GP VGP_EBORS | rVSV-EBOV
Type:
Protein
Mol. Mass.:
74522.01
Organism:
REBOV
Description:
Q89853
Residue:
677
  
Inhibitor
Name:
BDBM574778
Synonyms:
US11459308, Compound 3747
Type:
Small organic molecule
Emp. Form.:
C28H34N4O2
Mol. Mass.:
458.5952
SMILES:
CC(C)(C)N1CCCN(CC1)c1ccc(c(NC(c2ccccc2)c2ccccc2)c1)[N+]([O-])=O
: