Target
Envelope glycoprotein
Ligand
BDBM574795
Substrate
Meas. Tech.
Inhibition of Infectivity of Recombinant VSVs Expressing Glycoproteins from Zaire Ebolavirus, Sudan Ebolavirus, Bundybugyo Ebolavirus, and Lassa Arenavirus
IC50
800±n/a nM
Citation
 Bowlin, TLMoir, DTChandran, KDye, Jr., JMWilliams, JDAron, ZDBarbor, JPLively, KNNash, PJMills, DMBasu, A Broad spectrum inhibitors of filoviruses US Patent  US11459308 Publication Date 10/4/2022 
Target
Name:
Envelope glycoprotein
Synonyms:
GP VGP_EBORS | rVSV-EBOV
Type:
Protein
Mol. Mass.:
74522.01
Organism:
REBOV
Description:
Q89853
Residue:
677
  
Inhibitor
Name:
BDBM574795
Synonyms:
US11459308, Compound 3540
Type:
Small organic molecule
Emp. Form.:
C25H26F3N3
Mol. Mass.:
425.4892
SMILES:
CN1CCN(CC1)c1cc(NC(c2ccccc2)c2ccccc2)cc(c1)C(F)(F)F
: