Target
Envelope glycoprotein
Ligand
BDBM574808
Substrate
Meas. Tech.
Inhibition of Infectivity of Recombinant VSVs Expressing Glycoproteins from Zaire Ebolavirus, Sudan Ebolavirus, Bundybugyo Ebolavirus, and Lassa Arenavirus
IC50
1400±n/a nM
Citation
 Bowlin, TLMoir, DTChandran, KDye, Jr., JMWilliams, JDAron, ZDBarbor, JPLively, KNNash, PJMills, DMBasu, A Broad spectrum inhibitors of filoviruses US Patent  US11459308 Publication Date 10/4/2022 
Target
Name:
Envelope glycoprotein
Synonyms:
GP VGP_EBORS | rVSV-EBOV
Type:
Protein
Mol. Mass.:
74522.01
Organism:
REBOV
Description:
Q89853
Residue:
677
  
Inhibitor
Name:
BDBM574808
Synonyms:
US11459308, Compound 3644
Type:
Small organic molecule
Emp. Form.:
C26H30N4O4
Mol. Mass.:
462.5408
SMILES:
COc1ccc(cc1)C(Nc1cc(ccc1[N+]([O-])=O)N1CCN(C)CC1)c1ccc(OC)cc1
: