Target
Envelope glycoprotein
Ligand
BDBM574824
Substrate
Meas. Tech.
Inhibition of Authentic Filovirus Infections in Cell Culture Assays
IC50
2660±n/a nM
Citation
 Bowlin, TLMoir, DTChandran, KDye, Jr., JMWilliams, JDAron, ZDBarbor, JPLively, KNNash, PJMills, DMBasu, A Broad spectrum inhibitors of filoviruses US Patent  US11459308 Publication Date 10/4/2022 
Target
Name:
Envelope glycoprotein
Synonyms:
GP VGP_EBOZ5
Type:
Protein
Mol. Mass.:
74450.60
Organism:
ZEBOV
Description:
P87666
Residue:
676
  
Inhibitor
Name:
BDBM574824
Synonyms:
US11459308, Compound 4215A | US11459308, Compound 4251
Type:
Small organic molecule
Emp. Form.:
C24H26N4
Mol. Mass.:
370.49
SMILES:
CN(C)CCNc1ccc2ncn(C(c3ccccc3)c3ccccc3)c2c1
: