Target
Glutamate receptor ionotropic, NMDA 1/2C/3B
Ligand
BDBM557701
Substrate
Meas. Tech.
Scintillation Proximity Assay
Ki
180±n/a nM
Citation
 Kilburn, JPAscic, EMarigo, MDavid, L Modulators of the NMDA receptor US Patent  US11466027 Publication Date 10/11/2022 
Target
Name:
Glutamate receptor ionotropic, NMDA 1/2C/3B
Synonyms:
Type:
Protein
Mol. Mass.:
Description:
Components:
This complex has 3 components.
Component 1
Name:
Glutamate receptor ionotropic, NMDA 1
Synonyms:
GRIN1 Glutamate [NMDA] receptor subunit zeta-1 N-methyl-D-aspartate receptor subunit NR1 NMDZ1_HUMAN | phencyclidine
Type:
Enzyme Catalytic Domain
Mol. Mass.:
105397.81
Organism:
Homo sapiens (Human)
Description:
Q05586
Residue:
938
  
Component 2
Name:
Glutamate receptor ionotropic, NMDA 2C
Synonyms:
GRIN2C Ionotropic glutamate receptor NMDA 1/2C NMDE3_HUMAN
Type:
PROTEIN
Mol. Mass.:
134240.15
Organism:
Homo sapiens (Human)
Description:
ChEMBL_143328
Residue:
1233
  
Component 3
Name:
Glutamate receptor ionotropic, NMDA 3B
Synonyms:
GRIN3B N-methyl-D-aspartate receptor subtype 3B NMDAR3B | NR3B
Type:
Protein
Mol. Mass.:
113025.74
Organism:
Human
Description:
O60391
Residue:
1043
  
Inhibitor
Name:
BDBM557701
Synonyms:
US11358971, Compound 1j | US11466027, Compound 1n
Type:
Small organic molecule
Emp. Form.:
C12H12FN3O3S
Mol. Mass.:
297.305
SMILES:
N[C@H](CNC(=O)c1cc2nccc(CF)c2s1)C(O)=O
: