Target
Non-receptor tyrosine-protein kinase TYK2 [556-871]
Ligand
BDBM576253
Substrate
Meas. Tech.
Probe Displacement Assay
IC50
4.00±n/a nM
Citation
 Tami, MDale, RBrock, SJocelyn, W INHIBITION OF TYK2 DEPENDENT SIGNALING PATHWAYS WIPO 0:0 (2022) Target
Name:
Non-receptor tyrosine-protein kinase TYK2 [556-871]
Synonyms:
TYK2 | TYK2_HUMAN
Type:
Protein
Mol. Mass.:
35197.67
Organism:
Homo sapiens (Human)
Description:
P29597[556-871]
Residue:
316
  
Inhibitor
Name:
BDBM576253
Synonyms:
WO2022109580, Example 14
Type:
Small organic molecule
Emp. Form.:
C22H26N6O5
Mol. Mass.:
454.479
SMILES:
CO[C@@]1(CCOC1)c1cc(OCC2COC2)cc(n1)-n1nc(C)c2cnc(NC(N)=O)cc12
: