Target
Non-receptor tyrosine-protein kinase TYK2 [556-871]
Ligand
BDBM576259
Substrate
Meas. Tech.
Probe Displacement Assay
IC50
14±n/a nM
Citation
 Tami, MDale, RBrock, SJocelyn, W INHIBITION OF TYK2 DEPENDENT SIGNALING PATHWAYS WIPO 0:0 (2022) Target
Name:
Non-receptor tyrosine-protein kinase TYK2 [556-871]
Synonyms:
TYK2 | TYK2_HUMAN
Type:
Protein
Mol. Mass.:
35197.67
Organism:
Homo sapiens (Human)
Description:
P29597[556-871]
Residue:
316
  
Inhibitor
Name:
BDBM576259
Synonyms:
WO2022109580, Example 22
Type:
Small organic molecule
Emp. Form.:
C23H27N5O6S
Mol. Mass.:
501.555
SMILES:
CO[C@@]1(CCOC1)c1cc(OCC2CS(=O)(=O)C2)cc(n1)-n1cc(C)c2cnc(NC(N)=O)cc12
: