Target
Non-receptor tyrosine-protein kinase TYK2 [556-871]
Ligand
BDBM576262
Substrate
Meas. Tech.
Probe Displacement Assay
IC50
2.00±n/a nM
Citation
 Tami, MDale, RBrock, SJocelyn, W INHIBITION OF TYK2 DEPENDENT SIGNALING PATHWAYS WIPO 0:0 (2022) Target
Name:
Non-receptor tyrosine-protein kinase TYK2 [556-871]
Synonyms:
TYK2 | TYK2_HUMAN
Type:
Protein
Mol. Mass.:
35197.67
Organism:
Homo sapiens (Human)
Description:
P29597[556-871]
Residue:
316
  
Inhibitor
Name:
BDBM576262
Synonyms:
WO2022109580, Example 25
Type:
Small organic molecule
Emp. Form.:
C19H23N6O3
Mol. Mass.:
383.4243
SMILES:
CO[C@@]1(CCOC1)c1cc(C)cc(n1)-n1cc(C)n2cnc(NC(N)=O)cc12
: