Target
External core antigen
Ligand
BDBM576286
Substrate
Meas. Tech.
PHH Natural Infection Assay
IC50
1600±n/a nM
Citation
 Xianfeng, LHongying, YBo, ZXiufang, Z N-SUBSTITUTED 4-(5-PHENYL-1,3,4-OXADIAZOL-2-YL)ANILINE FOR THE TREATMENT AND PROPHYLAXIS OF HEPATITIS B VIRUS INFECTION WIPO 0:0 (2022) Target
Name:
External core antigen
Synonyms:
C HBeAg p25
Type:
Protein
Mol. Mass.:
24103.68
Organism:
HBVgbn
Description:
P89951
Residue:
212
  
Inhibitor
Name:
BDBM576286
Synonyms:
WO2022112139, Example 24
Type:
Small organic molecule
Emp. Form.:
C19H13N5O2
Mol. Mass.:
343.3388
SMILES:
O=C(Nc1ccc(cc1)-c1nnc(o1)-c1ccccc1)c1ccnnc1
: