Target
Ceramide glucosyltransferase
Ligand
BDBM576435
Substrate
Meas. Tech.
UDP-Glo Glucosylceramide Synthase Biochemical Assay
EC50
0.91±n/a nM
Citation
 J., BME., FMMarie, LHJ., MJJ., RAM., SKJ., SS MODIFIED ISOINDOLINONES AS GLUCOSYLCERAMIDE SYNTHASE INHIBITORS WIPO 0:0 (2022) Target
Name:
Ceramide glucosyltransferase
Synonyms:
CEGT_HUMAN GLCT-1 UDP-glucose ceramide glucosyltransferase UGCG
Type:
PROTEIN
Mol. Mass.:
44859.25
Organism:
Homo sapiens (Human)
Description:
ChEMBL_1435474
Residue:
394
  
Inhibitor
Name:
BDBM576435
Synonyms:
WO2022115301, Example 21
Type:
Small organic molecule
Emp. Form.:
C23H23F4NO3
Mol. Mass.:
437.4272
SMILES:
CC(C)(O)C(C1CC1)N1Cc2ccc(F)c(c2C1=O)-c1ccccc1OCC(F)(F)F
: