Target
Cannabinoid receptor 1
Ligand
BDBM50288368
Substrate
Meas. Tech.
Presto-Tango -Arrestin Recruitment Assay
EC50
0.430±n/a nM
Citation
 Das, ARoy, J Docosahexaenoic acid endocannabinoid epoxide derivative compositions US Patent  US11472787 Publication Date 10/18/2022 
Target
Name:
Cannabinoid receptor 1
Synonyms:
CANN6 CB-R CNR CNR1_HUMAN Cannabinoid receptor Cannabinoid receptor 1 (brain)
Type:
G Protein-Coupled Receptor (GPCR)
Mol. Mass.:
52868.96
Organism:
Homo sapiens (Human)
Description:
P21554
Residue:
472
  
Inhibitor
Name:
BDBM50288368
Synonyms:
CHEMBL4161934 | US11472787, Compound 10,11-EDP-EA
Type:
Small organic molecule
Emp. Form.:
C24H37NO3
Mol. Mass.:
387.5555
SMILES:
CC\C=C/C\C=C/C\C=C/CC1OC1C\C=C/C\C=C/CCC(=O)NCCO
: