Target
Growth arrest-specific protein 6
Ligand
BDBM308228
Substrate
Meas. Tech.
Activity Assay
IC50
7.70±n/a nM
Citation
 Wang, XZhang, WFrye, S Therapeutic uses of selected pyrimidine compounds with anti-Mer tyrosine kinase activity US Patent  US9649309 Publication Date 5/16/2017 
Target
Name:
Growth arrest-specific protein 6
Synonyms:
AXL receptor tyrosine kinase ligand GAS-6 GAS6_HUMAN
Type:
PROTEIN
Mol. Mass.:
74914.43
Organism:
Homo sapiens (Human)
Description:
Q14393
Residue:
678
  
Inhibitor
Name:
BDBM308228
Synonyms:
US9649309, Compound UNC4161A
Type:
Small organic molecule
Emp. Form.:
C25H40N6O
Mol. Mass.:
440.6247
SMILES:
CCCCNc1ncc(c(N[C@H]2CC[C@H](O)CC2)n1)-c1ccc(CNCC(C)(C)C)cn1
: