Target
Receptor-type tyrosine-protein kinase FLT3
Ligand
BDBM308228
Substrate
Meas. Tech.
Activity Assay
IC50
6.60±n/a nM
Citation
 Wang, XZhang, WFrye, S Therapeutic uses of selected pyrimidine compounds with anti-Mer tyrosine kinase activity US Patent  US9649309 Publication Date 5/16/2017 
Target
Name:
Receptor-type tyrosine-protein kinase FLT3
Synonyms:
CD135 FL cytokine receptor FLK2 FLT3 Fetal liver kinase-2 Fms-like tyrosine kinase 3 (Flt-3) STK-1 Stem cell tyrosine kinase 1
Type:
Enzyme
Mol. Mass.:
112888.62
Organism:
Homo sapiens (Human)
Description:
P36888
Residue:
993
  
Inhibitor
Name:
BDBM308228
Synonyms:
US9649309, Compound UNC4161A
Type:
Small organic molecule
Emp. Form.:
C25H40N6O
Mol. Mass.:
440.6247
SMILES:
CCCCNc1ncc(c(N[C@H]2CC[C@H](O)CC2)n1)-c1ccc(CNCC(C)(C)C)cn1
: