Target
Coagulation factor XIII A/B chain
Ligand
BDBM577483
Substrate
Meas. Tech.
Isopeptidase Assay for Estimating Inhibitor Potency
IC50
10.00±n/a nM
Citation
 Hils, MPasternack, RBüchold, C Inhibitors of blood coagulation factor XIII US Patent  US11472838 Publication Date 10/18/2022 
Target
Name:
Coagulation factor XIII A/B chain
Synonyms:
Coagulation factor XIII A2B2
Type:
Protein
Mol. Mass.:
Description:
Components:
This complex has 2 components.
Component 1
Name:
Coagulation factor XIII B chain
Synonyms:
F13B Fibrin-stabilizing factor B subunit Transglutaminase B chain
Type:
Protein
Mol. Mass.:
75508.41
Organism:
Human
Description:
P05160
Residue:
661
  
Component 2
Name:
Coagulation factor XIII A chain
Synonyms:
Coagulation factor XIII F13A1 | F13A_HUMAN
Type:
PROTEIN
Mol. Mass.:
83261.29
Organism:
Homo sapiens (Human)
Description:
ChEMBL_1475048
Residue:
732
  
Inhibitor
Name:
BDBM577483
Synonyms:
US11472838, Compound 5
Type:
Small organic molecule
Emp. Form.:
C42H59N7O11
Mol. Mass.:
837.9582
SMILES:
COC(=O)\C=C\CC[C@H](NC(=O)c1ccncc1C(O)=O)C(=O)N[C@H](C(=O)N1CC(=O)C[C@H]1C(=O)N[C@@H](C1CCCCC1)C(=O)N[C@@H](C1CCCCC1)C(N)=O)C(C)(C)C
: