Target
Coagulation factor XIII B chain
Ligand
BDBM577483
Substrate
Meas. Tech.
Transamidation Assay for Determining Inhibitor Selectivity
IC50
7.00±n/a nM
Citation
 Hils, MPasternack, RBüchold, C Inhibitors of blood coagulation factor XIII US Patent  US11472838 Publication Date 10/18/2022 
Target
Name:
Coagulation factor XIII B chain
Synonyms:
Type:
Protein
Mol. Mass.:
75059.25
Organism:
Rabbit
Description:
G1SEL4
Residue:
660
  
Inhibitor
Name:
BDBM577483
Synonyms:
US11472838, Compound 5
Type:
Small organic molecule
Emp. Form.:
C42H59N7O11
Mol. Mass.:
837.9582
SMILES:
COC(=O)\C=C\CC[C@H](NC(=O)c1ccncc1C(O)=O)C(=O)N[C@H](C(=O)N1CC(=O)C[C@H]1C(=O)N[C@@H](C1CCCCC1)C(=O)N[C@@H](C1CCCCC1)C(N)=O)C(C)(C)C
: