Target
Coagulation factor XIII A chain
Ligand
BDBM577528
Substrate
Meas. Tech.
Isopeptidase Assay for Estimating Inhibitor Potency
IC50
47.0±n/a nM
Citation
 Hils, MPasternack, RBüchold, C Inhibitors of blood coagulation factor XIII US Patent  US11472838 Publication Date 10/18/2022 
Target
Name:
Coagulation factor XIII A chain
Synonyms:
Coagulation factor XIII F13A1 | F13A_HUMAN
Type:
PROTEIN
Mol. Mass.:
83261.29
Organism:
Homo sapiens (Human)
Description:
ChEMBL_1475048
Residue:
732
  
Inhibitor
Name:
BDBM577528
Synonyms:
US11472838, Compound 38
Type:
Small organic molecule
Emp. Form.:
C41H58Cl2N6O10
Mol. Mass.:
865.839
SMILES:
CCOC(=O)\C=C\CC[C@H](NC(=O)c1cc(Cl)c(Cl)cc1C(O)=O)C(=O)N[C@@H](C(C)C)C(=O)N1CCC[C@H]1C(=O)N[C@@H](CC(C)C)C(=O)N[C@@H](C1CCCCC1)C(N)=O
: