Target
Prostaglandin G/H synthase 2
Ligand
BDBM13066
Substrate
Meas. Tech.
Enzyme (COXs) Inhibition Assay
IC50
20.0±1 nM
Citation
 Elsayed, MKBurayk, S Method for treating inflammation US Patent  US11478464 Publication Date 10/25/2022 
Target
Name:
Prostaglandin G/H synthase 2
Synonyms:
COX2 PGH2_HUMAN Prostaglandin endoperoxide H synthase-2 (PGHS-2)(FLAG-Native)
Type:
Enzyme
Mol. Mass.:
69995.82
Organism:
Homo sapiens (Human)
Description:
P35354; containing a FLAG tag at the N terminus
Residue:
612
  
Inhibitor
Name:
BDBM13066
Synonyms:
2-{2-[(2,6-dichlorophenyl)amino]phenyl}acetic acid Diclofenac US11478464, Compound Diclofenac {2-[(2,6-dichlorophenyl)amino]phenyl}acetic acid
Type:
Small organic molecule
Emp. Form.:
C14H11Cl2NO2
Mol. Mass.:
296.149
SMILES:
OC(=O)Cc1ccccc1Nc1c(Cl)cccc1Cl
: