Target
Dual specificity calcium/calmodulin-dependent 3',5'-cyclic nucleotide phosphodiesterase 1B
Ligand
BDBM279114
Substrate
Meas. Tech.
PDE1 Inhibition Assay
IC50
0.095±n/a nM
Citation
 Kehler, JJuhl, KMarigo, MVital, PJJessing, MLanggård, MRasmussen, LKClementson, CM 1H-pyrazolo[4,3-b]pyridines as PDE1 inhibitors US Patent  US11491140 Publication Date 11/8/2022 
Target
Name:
Dual specificity calcium/calmodulin-dependent 3',5'-cyclic nucleotide phosphodiesterase 1B
Synonyms:
63 kDa Cam-PDE Calcium/calmodulin-dependent 3',5'-cyclic nucleotide phosphodiesterase 1B PDE1B PDE1B_HUMAN Phosphodiesterase 1B Phosphodiesterase Type 1 (PDE1B) | Phosphodiesterase, PDE1/PDE5
Type:
Enzyme
Mol. Mass.:
61366.51
Organism:
Homo sapiens (Human)
Description:
Residue:
536
  
Inhibitor
Name:
BDBM279114
Synonyms:
1-isopropyl-3-methyl-N-[(1-methyl-1,2,4-triazol-3-yl)methyl]-5-(2-propoxy-3-pyridyl)pyrazolo[4,3-b]pyridin-7-amine US10512632, Example 145 US10806718, Example 145 US11491140, Example 145 | US11634416, Example 145
Type:
Small organic molecule
Emp. Form.:
C22H28N8O
Mol. Mass.:
420.5107
SMILES:
CCCOc1ncccc1-c1cc(NCc2ncn(C)n2)c2n(nc(C)c2n1)C(C)C
: