Target
Mu-type opioid receptor
Ligand
BDBM179877
Substrate
Meas. Tech.
Opioid Receptor Binding Assay
IC50
1.10±n/a nM
Citation
 Blumberg, LCDeaver, DREyerman, DJWynn, TA Methods for treating depressive symptoms US Patent  US9656961 Publication Date 5/23/2017 
Target
Name:
Mu-type opioid receptor
Synonyms:
M-OR-1 MOR-1 MUOR1 Mu opiate receptor OPRM1 hMOP | mu-type opioid receptor isoform MOR-1
Type:
G Protein-Coupled Receptor (GPCR)
Mol. Mass.:
44789.51
Organism:
Homo sapiens (Human)
Description:
P35372
Residue:
400
  
Inhibitor
Name:
BDBM179877
Synonyms:
US10231963, Table B.23 US10752592, Compound TABLE B.5 US9133125, Table B, Compound 5 | US9656961, Example 00140
Type:
Small organic molecule
Emp. Form.:
C22H28N2O3
Mol. Mass.:
368.4693
SMILES:
NC(=O)c1ccc2C[C@@H]3[C@@H]4CCC(=O)C[C@]4(CCN3CC3CCC3)c2c1O
: