Target
VHL complex
Ligand
BDBM454884
Substrate
Meas. Tech.
Fluorescence Polarization Assay (1% in DMSO)
IC50
178±n/a nM
Citation
 Crew, APCrews, CMChen, XDong, HFerraro, CQian, YSiu, KWang, JJin, MBerlin, MZimmermann, K Compounds and methods for the enhanced degradation of targeted proteins US Patent  US11512083 Publication Date 11/29/2022 
Target
Name:
VHL complex
Synonyms:
Type:
Protein
Mol. Mass.:
Description:
Components:
This complex has 3 components.
Component 1
Name:
von Hippel-Lindau disease tumor suppressor
Synonyms:
Protein G7 VHL_HUMAN Von Hippel-Lindau disease tumor suppressor protein (VBC) | pVHL
Type:
Protein
Mol. Mass.:
24136.87
Organism:
Homo sapiens (Human)
Description:
P40337
Residue:
213
  
Component 2
Name:
Cullin-2
Synonyms:
CUL-2 CUL2_HUMAN
Type:
Protein
Mol. Mass.:
86987.14
Organism:
Human
Description:
Q13617
Residue:
745
  
Component 3
Name:
E3 ubiquitin-protein ligase RBX1
Synonyms:
E3 ubiquitin-protein transferase RBX1 RBX1 RING finger protein 75 RNF75 Regulator of cullins 1
Type:
Protein
Mol. Mass.:
12275.36
Organism:
Human
Description:
P62877
Residue:
108
  
Inhibitor
Name:
BDBM454884
Synonyms:
US10730870, Example 47 | US11512083, Example 47
Type:
Small organic molecule
Emp. Form.:
C30H31N5O4S
Mol. Mass.:
557.663
SMILES:
CC(C)[C@H](N1Cc2cccc(C#N)c2C1=O)C(=O)N1C[C@H](O)C[C@H]1C(=O)NCc1ccc(cc1)-c1scnc1C
: