Target
Histone deacetylase 1/11/4/6/8
Ligand
BDBM65483
Substrate
Meas. Tech.
HDAC Activity screening
IC50
230±n/a nM
Citation
 Balasubramanian, GKilambi, NRathinasamy, SRajendran, PNarayanan, SRajagopal, S Quinolone-based HDAC inhibitors. J Enzyme Inhib Med Chem 29:555-62 (2014)  
Target
Name:
Histone deacetylase 1/11/4/6/8
Synonyms:
Histone acetylases (HDACs)
Type:
Protein
Mol. Mass.:
Description:
HeLa nuclear extract
Components:
This complex has 5 components.
Component 1
Name:
Histone deacetylase 1
Synonyms:
Cereblon/Histone deacetylase 1 HDAC1 Histone deacetylase 1 (HDAC1) RPD3L1
Type:
Enzyme
Mol. Mass.:
55090.27
Organism:
Homo sapiens (Human)
Description:
Q13547
Residue:
482
  
Component 2
Name:
Histone deacetylase 8
Synonyms:
HD8 HDAC8_HUMAN Histone deacetylase 8 (HDAC-8) | Human HDAC8
Type:
Enzyme
Mol. Mass.:
41749.60
Organism:
Homo sapiens (Human)
Description:
Q9BY41
Residue:
377
  
Component 3
Name:
Histone deacetylase 4
Synonyms:
Cereblon/Histone deacetylase 4 HDAC4 Histone acetylase 4(HDAC4) KIAA0288
Type:
Enzyme
Mol. Mass.:
119049.39
Organism:
Homo sapiens (Human)
Description:
P56524
Residue:
1084
  
Component 4
Name:
Histone deacetylase 6
Synonyms:
Cereblon/Histone deacetylase 6 HDAC6 Histone deacetylase 6 (HDAC6) KIAA0901 | ORF Names:JM21
Type:
Chromatin regulator; hydrolase; repressor
Mol. Mass.:
131381.51
Organism:
Homo sapiens (Human)
Description:
Q9UBN7
Residue:
1215
  
Component 5
Name:
Histone deacetylase 11
Synonyms:
HD11 HDAC11 | Human HDAC11
Type:
Chromatin regulator; hydrolase; repressor
Mol. Mass.:
39187.66
Organism:
Homo sapiens (Human)
Description:
Q96DB2
Residue:
347
  
Inhibitor
Name:
BDBM65483
Synonyms:
Quinolone-based HDAC inhibitor 4t
Type:
Small organic molecule
Emp. Form.:
C23H24FN3O6
Mol. Mass.:
457.4516
SMILES:
COc1ccc(NC(=O)c2cn(CCCCC(=O)NO)c3ccc(F)cc3c2=O)cc1OC
: