Target
Bifunctional dihydrofolate reductase-thymidylate synthase
Ligand
BDBM585298
Substrate
Meas. Tech.
TBD
IC50
2.00±n/a nM
Citation
 Thomas, SBHopper, ATWelsch, M Compositions and methods for treating infections US Patent  US11530198 Publication Date 12/20/2022 
Target
Name:
Bifunctional dihydrofolate reductase-thymidylate synthase
Synonyms:
DHFR-TS Dihydrofolate reductase Dihydrofolate reductase; T. gondii vs rat
Type:
Enzyme
Mol. Mass.:
68757.49
Organism:
Toxoplasma gondii
Description:
Q07422
Residue:
610
  
Inhibitor
Name:
BDBM585298
Synonyms:
5-(4-([1,1'-biphenyl]-3-yl)-3- methylpiperazin-1- yl)pyrimidine-2,4-diamine | US11530198, Example 26
Type:
Small organic molecule
Emp. Form.:
C21H24N6
Mol. Mass.:
360.4555
SMILES:
CC1CN(CCN1c1cccc(c1)-c1ccccc1)c1cnc(N)nc1N
: