Target
Bifunctional dihydrofolate reductase-thymidylate synthase
Ligand
BDBM50531779
Substrate
Meas. Tech.
TBD
IC50
1.91±n/a nM
Citation
 Thomas, SBHopper, ATWelsch, M Compositions and methods for treating infections US Patent  US11530198 Publication Date 12/20/2022 
Target
Name:
Bifunctional dihydrofolate reductase-thymidylate synthase
Synonyms:
DHFR-TS Dihydrofolate Reductase-Thymidylate Synthase (DHFR-TS) Mutant KICB1 PfDHFR-TS double mutant (C59R+S108N)
Type:
Enzyme
Mol. Mass.:
71822.51
Organism:
Plasmodium falciparum (isolate K1 / Thailand)
Description:
The mutant clone was prepared by cassette mutagenesis using wildtype pfDHFR as a template, and expressed in E. coli.
Residue:
608
  
Inhibitor
Name:
BDBM50531779
Synonyms:
CHEMBL4553229 | US11530198, Example 4
Type:
Small organic molecule
Emp. Form.:
C14H18N6
Mol. Mass.:
270.3329
SMILES:
Nc1ncc(N2CCN(CC2)c2ccccc2)c(N)n1
: