Target
Bifunctional dihydrofolate reductase-thymidylate synthase
Ligand
BDBM50531784
Substrate
Meas. Tech.
TBD
IC50
0.708±n/a nM
Citation
 Thomas, SBHopper, ATWelsch, M Compositions and methods for treating infections US Patent  US11530198 Publication Date 12/20/2022 
Target
Name:
Bifunctional dihydrofolate reductase-thymidylate synthase
Synonyms:
DHFR-TS Dihydrofolate Reductase-Thymidylate Synthase (DHFR-TS) Mutant KICB1 PfDHFR-TS double mutant (C59R+S108N)
Type:
Enzyme
Mol. Mass.:
71822.51
Organism:
Plasmodium falciparum (isolate K1 / Thailand)
Description:
The mutant clone was prepared by cassette mutagenesis using wildtype pfDHFR as a template, and expressed in E. coli.
Residue:
608
  
Inhibitor
Name:
BDBM50531784
Synonyms:
Fanotaprim TRC-2533-NX VYR-006
Type:
Small organic molecule
Emp. Form.:
C19H22N8O
Mol. Mass.:
378.431
SMILES:
COc1ncc(cn1)-c1cccc(c1)N1CCN(CC1)c1cnc(N)nc1N
: